{"text_format":"1","workbook":"xlsx","n_sheets":7,"sheets":["Soja 1ª","Trigo + Soja 2ª","Instrucciones","Calculadora BCCBA","Listas","Maíz temprano","Maíz tardío"],"not_rendered":{"charts":8,"images":13,"macros":1,"external_links":0,"defined_names":0,"comments":9,"pivot_tables":0},"unopened":[],"bounds":{"document_bytes":16777216,"sheet_cells":100000,"rows_first":2000,"rows_last":500,"rows_between":2000,"halvings":0,"cell_chars":16384,"cell_head_chars":4096},"cells_cut":0,"cells_raw":0,"read":"whole","date_system":"1900"}

{"sheet":"Soja 1ª","index":0,"n_rows":109,"n_cols":32,"rows_kept":109,"cut":false,"hidden":true,"merged":[[95,1,95,2],[95,3,95,4],[84,1,84,2],[85,1,85,2],[86,1,86,2],[87,1,87,2],[88,1,88,2],[89,1,89,2],[90,1,90,2],[91,1,91,2],[93,1,93,4],[94,1,94,2],[94,3,94,4],[96,1,96,2],[96,3,96,4],[97,1,97,2],[97,3,97,4],[98,1,98,2],[98,3,98,4],[99,1,99,2],[99,3,99,4],[100,1,100,2],[100,3,100,4],[101,1,101,2],[101,3,101,4],[108,1,108,2],[108,3,108,4],[102,1,102,2],[102,3,102,4],[103,1,103,2],[103,3,103,4],[104,1,104,2],[104,3,104,4],[105,1,105,2],[105,3,105,4],[106,1,106,2],[106,3,106,4],[107,3,107,4]]}
[]
[null,"Planteo Tecnico (Por Ha)","Unidad de medida","Mes de actualiz.","Cantidades","Calamuchita","Capital","Colón","Cruz del Eje","Gral. Roca","Gral. San Martín","Ischilin","Juárez Celman","Marcos Juárez","Minas","Pocho","Pte. R. Sáenz Peña","Punilla","Río Cuarto","Río Primero","Río Seco","Río Segundo","San Alberto","San Javier","San Justo","Santa María","Sobremonte","Tercero Arriba","Totoral","Tulumba","Unión","PROVINCIA"]
[null,"Rendimiento","qq/ha","Junio","-",{"$f":"+'Calculadora BCCBA'!$C$6","v":34.459548157843251},{"$f":"+'Calculadora BCCBA'!$C$6","v":34.459548157843251},{"$f":"+'Calculadora BCCBA'!$C$6","v":34.459548157843251},{"$f":"+'Calculadora BCCBA'!$C$6","v":34.459548157843251},{"$f":"+'Calculadora BCCBA'!$C$6","v":34.459548157843251},{"$f":"+'Calculadora BCCBA'!$C$6","v":34.459548157843251},{"$f":"+'Calculadora BCCBA'!$C$6","v":34.459548157843251},{"$f":"+'Calculadora BCCBA'!$C$6","v":34.459548157843251},{"$f":"+'Calculadora BCCBA'!$C$6","v":34.459548157843251},{"$f":"+'Calculadora BCCBA'!$C$6","v":34.459548157843251},{"$f":"+'Calculadora BCCBA'!$C$6","v":34.459548157843251},{"$f":"+'Calculadora BCCBA'!$C$6","v":34.459548157843251},{"$f":"+'Calculadora BCCBA'!$C$6","v":34.459548157843251},{"$f":"+'Calculadora BCCBA'!$C$6","v":34.459548157843251},{"$f":"+'Calculadora BCCBA'!$C$6","v":34.459548157843251},{"$f":"+'Calculadora BCCBA'!$C$6","v":34.459548157843251},{"$f":"+'Calculadora BCCBA'!$C$6","v":34.459548157843251},{"$f":"+'Calculadora BCCBA'!$C$6","v":34.459548157843251},{"$f":"+'Calculadora BCCBA'!$C$6","v":34.459548157843251},{"$f":"+'Calculadora BCCBA'!$C$6","v":34.459548157843251},{"$f":"+'Calculadora BCCBA'!$C$6","v":34.459548157843251},{"$f":"+'Calculadora BCCBA'!$C$6","v":34.459548157843251},{"$f":"+'Calculadora BCCBA'!$C$6","v":34.459548157843251},{"$f":"+'Calculadora BCCBA'!$C$6","v":34.459548157843251},{"$f":"+'Calculadora BCCBA'!$C$6","v":34.459548157843251},{"$f":"+'Calculadora BCCBA'!$C$6","v":34.459548157843251},{"$f":"+'Calculadora BCCBA'!$C$6","v":34.459548157843251}]
[null,"Participación Provincial","Porcentaje","Enero","-",9.403263139202804E-3,null,1.0724842138899085E-2,null,9.7563731325537251E-2,2.9249667199168283E-2,null,6.7922607057211884E-2,9.8552829870499015E-2,null,null,5.2536804655069477E-2,null,0.21873811666994233,5.4991854543402482E-2,1.0965423706116641E-2,4.9143198525754821E-2,null,null,6.9470460322297603E-2,3.1982514709585068E-2,null,5.8791586587649186E-2,2.0598609750489712E-2,1.3412614243288493E-2,0.10260334351537288,"-"]
[null,"Pulverización terrestre","Cantidad","Octubre",4,{"$f":"$E5","v":4},null,4,null,4,4,null,4,4,null,null,{"$f":"$E5","v":4},null,4,4,4,4,null,null,4,4,null,4,4,4,4,{"$f":"SUMPRODUCT(F5:AE5,$F$4:$AE$4)","v":3.986605871837948}]
[null,"Pulverización aerea","Cantidad",{"$f":"D5","v":"Octubre"},2,2,null,2,null,2,2,null,2,2,null,null,2,null,2,2,2,2,null,null,2,2,null,2,2,2,2,{"$f":"SUMPRODUCT(F6:AE6,$F$4:$AE$4)","v":1.993302935918974}]
[null,"Glifosato","lt/ha","Octubre",7,7,null,7,null,7,7,null,7,7,null,null,7,null,7,7,7,7,null,null,7,7,null,7,7,7,7,{"$f":"SUMPRODUCT(F7:AE7,$F$4:$AE$4)","v":6.9765602757164107}]
[null,"Round Up Full II","lt/ha","Octubre",0,0,null,0,null,0,0,null,0,0,null,null,0,null,0,0,0,0,null,null,0,0,null,0,0,0,0,{"$f":"+AVERAGE(F8:AE8)","v":0}]
{"$rows_left_out":102}
{"sheet":"Trigo + Soja 2ª","index":1,"n_rows":173,"n_cols":32,"rows_kept":173,"cut":false,"hidden":true,"merged":[[125,1,125,2],[120,1,120,2],[121,1,121,2],[122,1,122,2],[123,1,123,2],[124,1,124,2],[137,1,137,2],[137,3,137,4],[126,1,126,2],[127,1,127,2],[128,1,128,2],[129,1,129,2],[130,1,130,2],[131,1,131,2],[132,1,132,2],[133,1,133,2],[135,1,135,4],[136,1,136,2],[136,3,136,4],[138,1,138,2],[138,3,138,4],[139,1,139,2],[139,3,139,4],[140,1,140,2],[140,3,140,4],[141,1,141,2],[141,3,141,4],[142,1,142,2],[142,3,142,4],[143,1,143,2],[143,3,143,4],[144,1,144,2],[144,3,144,4],[145,1,145,2],[145,3,145,4],[146,1,146,2],[146,3,146,4],[150,1,150,2],[150,3,150,4],[151,1,151,2],[151,3,151,4],[147,1,147,2],[147,3,147,4],[148,1,148,2],[148,3,148,4],[149,1,149,2],[149,3,149,4]]}
[]
[null,"Planteo Tecnico (Por Ha)","Unidad de medida","Mes de actualiz.","Cantidades","Calamuchita","Capital","Colón","Cruz del Eje","Gral. Roca","Gral. San Martín","Ischilin","Juárez Celman","Marcos Juárez","Minas","Pocho","Pte. R. Sáenz Peña","Punilla","Río Cuarto","Río Primero","Río Seco","Río Segundo","San Alberto","San Javier","San Justo","Santa María","Sobremonte","Tercero Arriba","Totoral","Tulumba","Unión","PROVINCIA"]
[null,"Rendimiento","qq/ha",null,"-",{"$f":"+'Calculadora BCCBA'!$C$5","v":28.14},{"$f":"+'Calculadora BCCBA'!$C$5","v":28.14},{"$f":"+'Calculadora BCCBA'!$C$5","v":28.14},{"$f":"+'Calculadora BCCBA'!$C$5","v":28.14},{"$f":"+'Calculadora BCCBA'!$C$5","v":28.14},{"$f":"+'Calculadora BCCBA'!$C$5","v":28.14},{"$f":"+'Calculadora BCCBA'!$C$5","v":28.14},{"$f":"+'Calculadora BCCBA'!$C$5","v":28.14},{"$f":"+'Calculadora BCCBA'!$C$5","v":28.14},{"$f":"+'Calculadora BCCBA'!$C$5","v":28.14},{"$f":"+'Calculadora BCCBA'!$C$5","v":28.14},{"$f":"+'Calculadora BCCBA'!$C$5","v":28.14},{"$f":"+'Calculadora BCCBA'!$C$5","v":28.14},{"$f":"+'Calculadora BCCBA'!$C$5","v":28.14},{"$f":"+'Calculadora BCCBA'!$C$5","v":28.14},{"$f":"+'Calculadora BCCBA'!$C$5","v":28.14},{"$f":"+'Calculadora BCCBA'!$C$5","v":28.14},{"$f":"+'Calculadora BCCBA'!$C$5","v":28.14},{"$f":"+'Calculadora BCCBA'!$C$5","v":28.14},{"$f":"+'Calculadora BCCBA'!$C$5","v":28.14},{"$f":"+'Calculadora BCCBA'!$C$5","v":28.14},{"$f":"+'Calculadora BCCBA'!$C$5","v":28.14},{"$f":"+'Calculadora BCCBA'!$C$5","v":28.14},{"$f":"+'Calculadora BCCBA'!$C$5","v":28.14},{"$f":"+'Calculadora BCCBA'!$C$5","v":28.14},{"$f":"+'Calculadora BCCBA'!$C$5","v":28.14},{"$f":"+'Calculadora BCCBA'!$C$5","v":28.14}]
[null,"Participación Provincial","Porcentaje",null,"-",3.099925344195723E-3,null,7.5494091726283968E-3,null,9.7227161533162132E-2,7.5141166614510063E-2,null,6.5093503910603576E-2,0.13036941617310768,null,null,0.10028750441963734,null,5.2332430368649194E-2,4.6536966470120386E-2,1.5344599268687724E-2,6.0655923756008055E-2,null,null,0.14822812462039653,1.0346866001569362E-3,null,2.527060185182857E-2,9.8639899514709247E-3,7.7207136738507015E-3,0.15275219380282087,"-"]
[null,"Pulverización terrestre","Cantidad","Mayo",3,{"$f":"$E5","v":3},null,{"$f":"$E5","v":3},null,{"$f":"$E5","v":3},3,null,{"$f":"$E5","v":3},3,null,null,{"$f":"$E5","v":3},null,{"$f":"$E5","v":3},3,3,3,null,null,{"$f":"$E5","v":3},3,null,{"$f":"$E5","v":3},3,3,3,{"$f":"SUMPRODUCT(F5:AE5,$F$4:$AE$4)","v":2.9955249525955039}]
[null,"Fertilización","Cantidad",{"$f":"D5","v":"Mayo"},1,1,null,1,null,1,1,null,1,1,null,null,1,null,1,1,1,1,null,null,1,1,null,1,1,1,1,{"$f":"SUMPRODUCT(F6:AE6,$F$4:$AE$4)","v":0.998508317531835}]
[null,"Pulverización aerea","Cantidad",{"$f":"D6","v":"Mayo"},0,0,null,0,null,0,0,null,0,0,null,null,0,null,0,0,0,0,null,null,0,0,null,0,0,0,0,{"$f":"+AVERAGE(F7:AE7)","v":0}]
[null,"Metsulfuron Metil","kg/ha",{"$f":"D7","v":"Mayo"},6.0000000000000001E-3,6.0000000000000001E-3,null,6.0000000000000001E-3,null,6.0000000000000001E-3,6.0000000000000001E-3,null,6.0000000000000001E-3,6.0000000000000001E-3,null,null,6.0000000000000001E-3,null,6.0000000000000001E-3,6.0000000000000001E-3,6.0000000000000001E-3,6.0000000000000001E-3,null,null,6.0000000000000001E-3,6.0000000000000001E-3,null,6.0000000000000001E-3,6.0000000000000001E-3,6.0000000000000001E-3,6.0000000000000001E-3,{"$f":"+AVERAGE(F8:AE8)","v":6.000000000000001E-3}]
{"$rows_left_out":166}
{"sheet":"Instrucciones","index":2,"n_rows":117,"n_cols":2,"rows_kept":117,"cut":false,"hidden":false,"merged":[[19,1,20,9],[116,1,120,4],[0,1,0,10]]}
[null,"Calculadora de Márgenes Agropecuarios"]
[]
[null,"Paso 1:"]
[]
[null,"Dirigirse a la pestaña de \"Calculadora BCCBA\" en la parte inferior del Excel."]
[null,"EVITAR AGREGAR/QUITAR FILAS Y COLUMNAS EN ESTE EXCEL PARA SU CORRECTO FUNCIONAMIENTO."]
[]
[]
{"$rows_left_out":110}
{"sheet":"Calculadora BCCBA","index":3,"n_rows":49,"n_cols":20,"rows_kept":49,"cut":false,"hidden":false,"merged":[[0,13,0,19],[24,1,24,2],[30,15,30,19],[31,13,37,13],[2,1,2,2],[0,1,0,9],[2,4,2,5],[2,14,2,16],[3,14,3,19],[4,14,4,19],[15,14,15,19],[16,14,16,19],[42,15,42,19],[43,13,49,13],[6,15,6,19],[7,13,13,13],[18,15,18,19],[19,13,25,13],[28,14,28,19],[27,14,27,19],[39,14,39,19],[40,14,40,19]]}
[null,"PROVINCIA",null,null,null,null,null,null,null,null,null,null,null,"Analisis de Sensibilidad Precio-Rendimiento"]
[]
[null,"Podés modificar los datos en amarillo",null,null,{"$f":"\"Rentabilidad Campaña 2019/20\"&CHAR(10)&\" Der. de export. \"&TEXT(C23,\"#%\")&\" maíz, \"&TEXT(C21,\"#%\")&\" trigo y \"&TEXT(C22,\"#%\")&\" soja.\"","v":"Rentabilidad Campaña 2019/20\n Der. de export. 15% maíz, 20% trigo y 35% soja."},null,null,null,null,null,null,null,null,null,"Nota: Antes de ver el análisis clickear en \"Ejecutar\"."]
[null,null,null,null,"Rendimiento","qq/ha",{"$f":"+HLOOKUP($B$1,'Soja 1ª'!$F$94:$AF$109,2,FALSE)","v":34.459548157843251},{"$f":"TEXT(C5,\"##\")&\" || \"&TEXT(C7,\"##\")","v":"28 || 29"},{"$f":"+HLOOKUP($B$1,'Maíz temprano'!$F$90:$AF$105,2,FALSE)","v":86.91593325668596},{"$f":"+HLOOKUP($B$1,'Maíz tardío'!$F$90:$AF$105,2,FALSE)","v":75.091015314727898},null,null,null,null,"SOJA"]
[null,"Rendimiento trigo",{"$f":"INDEX(Listas!$A$1:$G$19,MATCH('Calculadora BCCBA'!$B$1,Listas!$A$1:$A$19,0),MATCH('Calculadora BCCBA'!$B$5,Listas!$A$1:$G$1,0))","v":28.14},null,"Precio Disponible","USD/qq",{"$f":"+HLOOKUP($B$1,'Soja 1ª'!$F$94:$AF$109,3,FALSE)","v":204.95875000000004},{"$f":"TEXT('Trigo + Soja 2ª'!E121,\"##\")&\" || \"&TEXT('Trigo + Soja 2ª'!E122,\"##\")","v":"144 || 205"},{"$f":"+HLOOKUP($B$1,'Maíz temprano'!$F$90:$AF$105,3,FALSE)","v":128.47},{"$f":"+HLOOKUP($B$1,'Maíz tardío'!$F$90:$AF$105,3,FALSE)","v":122.52850000000001},null,null,null,null,{"$f":"+\"DER. DE EXPORTACIÓN \"&TEXT(C22,\"##%\")&\" A LA SOJA.\"","v":"DER. DE EXPORTACIÓN 35% A LA SOJA."}]
[null,"Rendimiento soja 1ª",{"$f":"INDEX(Listas!$A$1:$G$19,MATCH('Calculadora BCCBA'!$B$1,Listas!$A$1:$A$19,0),MATCH('Calculadora BCCBA'!$B$6,Listas!$A$1:$G$1,0))","v":34.459548157843251},null,"Ingresos Totales","USD/ha",{"$f":"+HLOOKUP($B$1,'Soja 1ª'!$F$94:$AF$109,4,FALSE)","v":706.27859159963566},{"$f":"+HLOOKUP($B$1,'Trigo + Soja 2ª'!$F$136:$AF$152,6,FALSE)","v":989.57406161112669},{"$f":"+HLOOKUP($B$1,'Maíz temprano'!$F$90:$AF$105,4,FALSE)","v":1116.6089945486444},{"$f":"+HLOOKUP($B$1,'Maíz tardío'!$F$90:$AF$105,4,FALSE)","v":920.07894699906376}]
[null,"Rendimiento soja 2ª",{"$f":"INDEX(Listas!$A$1:$G$19,MATCH('Calculadora BCCBA'!$B$1,Listas!$A$1:$A$19,0),MATCH('Calculadora BCCBA'!$B$7,Listas!$A$1:$G$1,0))","v":28.55219704507012},null,"Costos Directos","USD/ha",{"$f":"+HLOOKUP($B$1,'Soja 1ª'!$F$94:$AF$109,5,FALSE)","v":267.23162502247703},{"$f":"+HLOOKUP($B$1,'Trigo + Soja 2ª'!$F$136:$AF$152,7,FALSE)","v":493.23684830364141},{"$f":"+HLOOKUP($B$1,'Maíz temprano'!$F$90:$AF$105,5,FALSE)","v":381.46575137101081},{"$f":"+HLOOKUP($B$1,'Maíz tardío'!$F$90:$AF$105,5,FALSE)","v":371.73281924928045},null,null,null,null,null,"Rendimiento de soja (qq/ha)"]
[null,"Rendimiento maíz temprano",{"$f":"INDEX(Listas!$A$1:$G$19,MATCH('Calculadora BCCBA'!$B$1,Listas!$A$1:$A$19,0),MATCH('Calculadora BCCBA'!$B$8,Listas!$A$1:$G$1,0))","v":86.91593325668596},null,"Gastos Comerciales","USD/ha",{"$f":"+HLOOKUP($B$1,'Soja 1ª'!$F$94:$AF$109,6,FALSE)","v":131.18846727174861},{"$f":"+HLOOKUP($B$1,'Trigo + Soja 2ª'!$F$136:$AF$152,8,FALSE)","v":189.8255252237372},{"$f":"+HLOOKUP($B$1,'Maíz temprano'!$F$90:$AF$105,6,FALSE)","v":313.77447807281021},{"$f":"+HLOOKUP($B$1,'Maíz tardío'!$F$90:$AF$105,6,FALSE)","v":285.86334131450684},null,null,null,"Precio  disp. (USD/Tn)",{"$f":"+G18","v":1.6050429808147998E-2},23,25.5,28,30.5,33]
{"$rows_left_out":42}
{"sheet":"Listas","index":4,"n_rows":55,"n_cols":29,"rows_kept":55,"cut":false,"hidden":true,"merged":[[0,21,0,22],[0,24,0,25],[0,27,0,28],[0,8,0,9],[0,10,0,11],[0,12,0,13],[0,15,0,16],[0,18,0,19]]}
["Deptos","Rendimiento trigo","Rendimiento soja 1ª","Rendimiento soja 2ª","Rendimiento maíz temprano","Rendimiento maíz tardío",null,null,"Soja",null,"Maíz",null,"Trigo",null,null,"Calculador Soja 1ª",null,null,"Calculador Soja 2ª",null,null,"Calculador Trigo",null,null,"Calculador Maíz Temprano",null,null,"Calculador Maíz Tardío"]
["Calamuchita",16.14579925844172,31.061636953905747,25.736784904664759,76.395088497591985,77.303831146915897,null,null,"Rendimiento","Costos cosecha","Rendimiento","Costos cosecha","Rendimiento","Costos cosecha",null,"qq","Calamuchita",null,"qq","Calamuchita",null,"qq","Calamuchita",null,"qq","Calamuchita",null,"qq","Calamuchita"]
["Colón",24.873836344003649,32.575993104661059,26.991537143862015,76.5,71.814220215857901,null,null,{"$f":"+I4-2","v":10},{"$f":"+J4-(J5-J4)-3","v":2381},46,3263,{"$f":"+M4-2","v":10},{"$f":"+N4-N5+N4","v":2992},null,"Inicial",{"$f":"IF(ISBLANK(Q5),\"\",INT(INT(Q5)/2)*2)","v":34},null,"Inicial",{"$f":"IF(ISBLANK(T5),\"\",INT(INT(T5)/2)*2)","v":28},null,"Inicial",{"$f":"IF(ISBLANK(W5),\"\",INT(INT(W5)/2)*2)","v":28},null,"Inicial",{"$f":"IF(ISBLANK(Z5),\"\",INT((INT(Z5)+2)/4)*4-2)","v":86},null,"Inicial",{"$f":"IF(ISBLANK(AC5),\"\",INT((INT(AC5)+2)/4)*4-2)","v":74}]
["Gral. Roca",22.301898300051572,35.625797063759791,29.518517567115254,78.979766292167398,74.931877568025172,null,null,{"$f":"+I5-2","v":12},{"$f":"+J5-(J6-J5)-2","v":2456},50,3335,{"$f":"+M5-2","v":12},{"$f":"+N5-N6+N5","v":3043},null,"Final",{"$f":"IF(ISBLANK(Q5),\"\",Q3+2)","v":36},null,"Final",{"$f":"IF(ISBLANK(T5),\"\",T3+2)","v":30},null,"Final",{"$f":"IF(ISBLANK(W5),\"\",W3+2)","v":30},null,"Final",{"$f":"IF(ISBLANK(Z5),\"\",Z3+4)","v":90},null,"Final",{"$f":"IF(ISBLANK(AC5),\"\",AC3+4)","v":78}]
["Gral. San Martín",27.012731475406451,34.720471464112705,28.768390641693383,85.770317687075789,77.297894027702881,null,null,{"$f":"+I6-2","v":14},{"$f":"+J6-(J7-J6)-1","v":2528},54,3410,{"$f":"+M6-2","v":14},{"$f":"+N6-N7+N6","v":3094},null,"Depto",{"$f":"+'Calculadora BCCBA'!$C$6","v":34.459548157843251},null,"Depto",{"$f":"+'Calculadora BCCBA'!C7","v":28.55219704507012},null,"Depto",{"$f":"+'Calculadora BCCBA'!C5","v":28.14},null,"Depto",{"$f":"+'Calculadora BCCBA'!C8","v":86.91593325668596},null,"Depto",{"$f":"+'Calculadora BCCBA'!C9","v":75.091015314727898}]
["Juárez Celman",26.920704226441895,35.132298008038134,29.109618349517309,80.691441902871986,79.385975956620243,null,null,{"$f":"+I7-2","v":16},{"$f":"+J7-(J8-J7)","v":2598},58,3488,16,3145]
["Marcos Juárez",40.489328033023767,39.04199246659271,32.349079472319673,107.48423109077855,85.410530651747578,null,null,{"$f":"+I8-2","v":18},{"$f":"+J8-(J9-J8)+2","v":2667},62,3570,18,3196,null,"Precios","Calamuchita",null,"Precios","Calamuchita",null,"Precios","Calamuchita",null,"Precios","Calamuchita",null,"Precios","Calamuchita"]
["Pte. R. Sáenz Peña",25.444340437165621,34.826930888722138,28.856599879226913,81.163778379702507,76.274145902366641,null,null,20,2736,66,3656,20,3250,null,"Inicial",{"$f":"IF(Q3=\"\",\"\",VLOOKUP(Q3,$I$3:$J$26,2,FALSE))","v":3326},null,"Inicial",{"$f":"IF(T3=\"\",\"\",VLOOKUP(T3,$I$3:$J$26,2,FALSE))","v":3045},null,"Inicial",{"$f":"IF(W3=\"\",\"\",VLOOKUP(W3,$M$3:$N$26,2,FALSE))","v":3496},null,"Inicial",{"$f":"IF(Z3=\"\",\"\",VLOOKUP(Z3,$K$3:$L$26,2,FALSE))","v":4157},null,"Inicial",{"$f":"IF(AC3=\"\",\"\",VLOOKUP(AC3,$K$3:$L$26,2,FALSE))","v":3841}]
{"$rows_left_out":48}
{"sheet":"Maíz temprano","index":5,"n_rows":123,"n_cols":37,"rows_kept":123,"cut":false,"hidden":true,"merged":[[84,1,84,2],[79,1,79,2],[80,1,80,2],[81,1,81,2],[82,1,82,2],[83,1,83,2],[85,1,85,2],[86,1,86,2],[87,1,87,2],[89,1,89,4],[90,1,90,2],[90,3,90,4],[91,1,91,2],[91,3,91,4],[92,1,92,2],[92,3,92,4],[93,1,93,2],[93,3,93,4],[94,1,94,2],[94,3,94,4],[95,1,95,2],[95,3,95,4],[96,1,96,2],[96,3,96,4],[97,1,97,2],[97,3,97,4],[98,1,98,2],[98,3,98,4],[99,1,99,2],[99,3,99,4],[103,3,103,4],[104,1,104,2],[104,3,104,4],[100,1,100,2],[100,3,100,4],[101,1,101,2],[101,3,101,4],[102,1,102,2],[102,3,102,4]]}
[]
[null,"Planteo Tecnico (Por Ha)","Unidad de medida","Mes de actualiz.","Cantidades","Calamuchita","Capital","Colón","Cruz del Eje","Gral. Roca","Gral. San Martín","Ischilin","Juárez Celman","Marcos Juárez","Minas","Pocho","Pte. R. Sáenz Peña","Punilla","Río Cuarto","Río Primero","Río Seco","Río Segundo","San Alberto","San Javier","San Justo","Santa María","Sobremonte","Tercero Arriba","Totoral","Tulumba","Unión","PROVINCIA"]
[null,"Rendimiento","qq/ha","Noviembre","-",{"$f":"+'Calculadora BCCBA'!$C$8","v":86.91593325668596},null,{"$f":"+'Calculadora BCCBA'!$C$8","v":86.91593325668596},null,{"$f":"+'Calculadora BCCBA'!$C$8","v":86.91593325668596},{"$f":"+'Calculadora BCCBA'!$C$8","v":86.91593325668596},null,{"$f":"+'Calculadora BCCBA'!$C$8","v":86.91593325668596},{"$f":"+'Calculadora BCCBA'!$C$8","v":86.91593325668596},null,null,{"$f":"+'Calculadora BCCBA'!$C$8","v":86.91593325668596},null,{"$f":"+'Calculadora BCCBA'!$C$8","v":86.91593325668596},{"$f":"+'Calculadora BCCBA'!$C$8","v":86.91593325668596},{"$f":"+'Calculadora BCCBA'!$C$8","v":86.91593325668596},{"$f":"+'Calculadora BCCBA'!$C$8","v":86.91593325668596},null,null,{"$f":"+'Calculadora BCCBA'!$C$8","v":86.91593325668596},{"$f":"+'Calculadora BCCBA'!$C$8","v":86.91593325668596},null,{"$f":"+'Calculadora BCCBA'!$C$8","v":86.91593325668596},{"$f":"+'Calculadora BCCBA'!$C$8","v":86.91593325668596},{"$f":"+'Calculadora BCCBA'!$C$8","v":86.91593325668596},{"$f":"+'Calculadora BCCBA'!$C$8","v":86.91593325668596},{"$f":"+'Calculadora BCCBA'!$C$8","v":86.91593325668596}]
[null,"Participación Provincial","Porcentaje","Noviembre","-",1,null,null,null,null,null,null,null,null,null,null,null,null,null,null,null,null,null,null,null,null,null,null,null,null,null,"-"]
[null,"Pulverización terrestre","Cantidad","Septiembre",2,{"$f":"$E5","v":2},null,2,null,2,2,null,2,2,null,null,2,null,2,2,2,{"$f":"$E5","v":2},null,null,2,2,null,2,2,2,2,{"$f":"SUMPRODUCT(F5:AE5,$F$4:$AE$4)","v":2}]
[null,"Fertilización","Cantidad",{"$f":"D5","v":"Septiembre"},1,1,null,1,null,1,1,null,1,1,null,null,1,null,1,1,1,1,null,null,1,1,null,1,1,1,1,{"$f":"SUMPRODUCT(F6:AE6,$F$4:$AE$4)","v":1}]
[null,"Glifosato","lt/ha",{"$f":"D6","v":"Septiembre"},2.5,2.5,null,2.5,null,2.5,2.5,null,2.5,2.5,null,null,2.5,null,2.5,2.5,2.5,2.5,null,null,2.5,2.5,null,2.5,2.5,2.5,2.5,{"$f":"+AVERAGE(F7:AE7)","v":2.5}]
[null,"Atrazina 90%","kg/ha","Septiembre",1,1,null,1,null,1,1,null,1,1,null,null,1,null,1,1,1,1,null,null,1,1,null,1,1,1,1,{"$f":"+AVERAGE(F8:AE8)","v":1}]
{"$rows_left_out":116}
{"sheet":"Maíz tardío","index":6,"n_rows":125,"n_cols":37,"rows_kept":125,"cut":false,"hidden":true,"merged":[[84,1,84,2],[79,1,79,2],[80,1,80,2],[81,1,81,2],[82,1,82,2],[83,1,83,2],[85,1,85,2],[86,1,86,2],[87,1,87,2],[89,1,89,4],[90,1,90,2],[90,3,90,4],[91,1,91,2],[91,3,91,4],[92,1,92,2],[92,3,92,4],[93,1,93,2],[93,3,93,4],[94,1,94,2],[94,3,94,4],[95,1,95,2],[95,3,95,4],[96,1,96,2],[96,3,96,4],[97,1,97,2],[97,3,97,4],[98,1,98,2],[98,3,98,4],[99,1,99,2],[99,3,99,4],[103,3,103,4],[104,1,104,2],[104,3,104,4],[100,1,100,2],[100,3,100,4],[101,1,101,2],[101,3,101,4],[102,1,102,2],[102,3,102,4]]}
[]
[null,"Planteo Tecnico (Por Ha)","Unidad de medida","Mes de actualiz.","Cantidades","Calamuchita","Capital","Colón","Cruz del Eje","Gral. Roca","Gral. San Martín","Ischilin","Juárez Celman","Marcos Juárez","Minas","Pocho","Pte. R. Sáenz Peña","Punilla","Río Cuarto","Río Primero","Río Seco","Río Segundo","San Alberto","San Javier","San Justo","Santa María","Sobremonte","Tercero Arriba","Totoral","Tulumba","Unión","PROVINCIA"]
[null,"Rendimiento","qq/ha","Noviembre","-",{"$f":"+'Calculadora BCCBA'!$C$9","v":75.091015314727898},{"$f":"+'Calculadora BCCBA'!$C$9","v":75.091015314727898},{"$f":"+'Calculadora BCCBA'!$C$9","v":75.091015314727898},{"$f":"+'Calculadora BCCBA'!$C$9","v":75.091015314727898},{"$f":"+'Calculadora BCCBA'!$C$9","v":75.091015314727898},{"$f":"+'Calculadora BCCBA'!$C$9","v":75.091015314727898},{"$f":"+'Calculadora BCCBA'!$C$9","v":75.091015314727898},{"$f":"+'Calculadora BCCBA'!$C$9","v":75.091015314727898},{"$f":"+'Calculadora BCCBA'!$C$9","v":75.091015314727898},{"$f":"+'Calculadora BCCBA'!$C$9","v":75.091015314727898},{"$f":"+'Calculadora BCCBA'!$C$9","v":75.091015314727898},{"$f":"+'Calculadora BCCBA'!$C$9","v":75.091015314727898},{"$f":"+'Calculadora BCCBA'!$C$9","v":75.091015314727898},{"$f":"+'Calculadora BCCBA'!$C$9","v":75.091015314727898},{"$f":"+'Calculadora BCCBA'!$C$9","v":75.091015314727898},{"$f":"+'Calculadora BCCBA'!$C$9","v":75.091015314727898},{"$f":"+'Calculadora BCCBA'!$C$9","v":75.091015314727898},{"$f":"+'Calculadora BCCBA'!$C$9","v":75.091015314727898},{"$f":"+'Calculadora BCCBA'!$C$9","v":75.091015314727898},{"$f":"+'Calculadora BCCBA'!$C$9","v":75.091015314727898},{"$f":"+'Calculadora BCCBA'!$C$9","v":75.091015314727898},{"$f":"+'Calculadora BCCBA'!$C$9","v":75.091015314727898},{"$f":"+'Calculadora BCCBA'!$C$9","v":75.091015314727898},{"$f":"+'Calculadora BCCBA'!$C$9","v":75.091015314727898},{"$f":"+'Calculadora BCCBA'!$C$9","v":75.091015314727898},{"$f":"+'Calculadora BCCBA'!$C$9","v":75.091015314727898},{"$f":"+'Calculadora BCCBA'!$C$9","v":75.091015314727898}]
[null,"Participación Provincial","Porcentaje","Noviembre","-",1,null,null,null,null,null,null,null,null,null,null,null,null,null,null,null,null,null,null,null,null,null,null,null,null,null,"-"]
[null,"Pulverización terrestre","Cantidad","Noviembre",2,{"$f":"$E5","v":2},null,2,null,2,2,null,2,2,null,null,2,null,2,2,2,{"$f":"$E5","v":2},null,null,2,2,null,2,2,2,2,{"$f":"SUMPRODUCT(F5:AE5,$F$4:$AE$4)","v":2}]
[null,"Fertilización","Cantidad",{"$f":"D5","v":"Noviembre"},1,1,null,1,null,1,1,null,1,1,null,null,1,null,1,1,1,1,null,null,1,1,null,1,1,1,1,{"$f":"SUMPRODUCT(F6:AE6,$F$4:$AE$4)","v":1}]
[null,"Glifosato","lt/ha",{"$f":"D6","v":"Noviembre"},2.5,2.5,null,2.5,null,2.5,2.5,null,2.5,2.5,null,null,2.5,null,2.5,2.5,2.5,2.5,null,null,2.5,2.5,null,2.5,2.5,2.5,2.5,{"$f":"+AVERAGE(F7:AE7)","v":2.5}]
[null,"Atrazina 90%","kg/ha","Noviembre",1,1,null,1,null,1,1,null,1,1,null,null,1,null,1,1,1,1,null,null,1,1,null,1,1,1,1,{"$f":"+AVERAGE(F8:AE8)","v":1}]
{"$rows_left_out":117}